finespun-a
type: LexicalEntry
canonical form: finespun
sense: 01955211-s
part of speech: adjective

delicate-a
type: LexicalEntry
canonical form: delicate
sense: 01955211-s
part of speech: adjective

01955211-s
type: LexicalConcept
in scheme: en-word.net
definition: developed with extreme delicacy and subtlety
example: the satire touches with finespun ridicule every kind of human pretense
ili: i10663
lexfile: adj.all
part of speech: adjective satellite
similar: https://en-word.net/synset/01953883-a