hover-v
type: LexicalEntry
canonical form: hover
sense: 01947307-v
part of speech: verb

01947307-v
type: LexicalConcept
in scheme: en-word.net
definition: hang in the air; fly or be suspended above
ili: i31440
lexfile: verb.motion
part of speech: verb
hypernym: 01944262-v