corner-v
type: LexicalEntry
canonical form: corner
sense: 01938064-v
part of speech: verb

tree-v
type: LexicalEntry
canonical form: tree
sense: 01938064-v
part of speech: verb

01938064-v
type: LexicalConcept
in scheme: en-word.net
definition: force a person or an animal into a position from which they cannot escape
ili: i31389
lexfile: verb.motion
part of speech: verb
hypernym: 01935739-v