navigate-v
type: LexicalEntry
canonical form: navigate
sense: 01937276-v
part of speech: verb

pilot-v
type: LexicalEntry
canonical form: pilot
sense: 01937276-v
part of speech: verb

01937276-v
type: LexicalConcept
in scheme: en-word.net
definition: act as the navigator in a car, plane, or vessel and plan, direct, plot the path and position of the conveyance
example: Is anyone volunteering to navigate during the trip?
example: Who was navigating the ship during the accident?
ili: i31386
lexfile: verb.motion
part of speech: verb
hypernym: 01935739-v