sprint-v
type: LexicalEntry
canonical form: sprint
sense: 01932532-v
part of speech: verb

01932532-v
type: LexicalConcept
in scheme: en-word.net
definition: run very fast, usually for a short distance
ili: i31360
lexfile: verb.motion
part of speech: verb
hypernym: 01930264-v