float-v
type: LexicalEntry
canonical form: float
sense: 01908286-v
part of speech: verb

swim-v
type: LexicalEntry
canonical form: swim
sense: 01908286-v
part of speech: verb

01908286-v
type: LexicalConcept
in scheme: en-word.net
definition: be afloat either on or below a liquid surface and not sink to the bottom
ili: i31241
lexfile: verb.motion
part of speech: verb
hypernym: 01839438-v
similar: 01878561-v
similar: 01842593-v