protective covering-n
type: LexicalEntry
canonical form: protective covering
sense: 01905209-n
part of speech: noun

01905209-n
type: LexicalConcept
in scheme: en-word.net
definition: the tough natural covering of some organisms
ili: i45331
lexfile: noun.animal
part of speech: noun
hypernym: 05245085-n