barb-n
type: LexicalEntry
canonical form: barb
sense: 01900826-n
part of speech: noun

01900826-n
type: LexicalConcept
in scheme: en-word.net
definition: one of the parallel filaments projecting from the main shaft of a feather
ili: i45301
lexfile: noun.animal
part of speech: noun
hypernym: 14892009-n