vibrate-v
type: LexicalEntry
canonical form: vibrate
sense: 01895242-v
part of speech: verb

01895242-v
type: LexicalConcept
in scheme: en-word.net
definition: shake, quiver, or throb; move back and forth rapidly, usually in an uncontrolled manner
ili: i31161
lexfile: verb.motion
part of speech: verb
hypernym: 01835473-v