naked-a
type: LexicalEntry
canonical form: naked
sense: 01892882-s
part of speech: adjective

defenseless-a
type: LexicalEntry
canonical form: defenseless
sense: 01892882-s
part of speech: adjective

01892882-s
type: LexicalConcept
in scheme: en-word.net
definition: having no protecting or concealing cover
example: naked to mine enemies
  source: Shakespeare
ili: i10352
lexfile: adj.all
part of speech: adjective satellite
similar: https://en-word.net/synset/01892506-a