fitting-a
type: LexicalEntry
canonical form: fitting
sense: 01885720-s
part of speech: adjective

decent-a
type: LexicalEntry
canonical form: decent
sense: 01885720-s
part of speech: adjective

01885720-s
type: LexicalConcept
in scheme: en-word.net
definition: in harmony with the spirit of particular persons or occasion
example: a decent burial
example: we have come to dedicate a portion of that field … It is altogether fitting and proper that we should do this
ili: i10315
lexfile: adj.all
part of speech: adjective satellite
similar: https://en-word.net/synset/01884565-a