wamble-v
type: LexicalEntry
canonical form: wamble
sense: 01875314-v
part of speech: verb

waggle-v
type: LexicalEntry
canonical form: waggle
sense: 01875314-v
part of speech: verb

01875314-v
type: LexicalConcept
in scheme: en-word.net
definition: move unsteadily or with a weaving or rolling motion
ili: i31061
lexfile: verb.motion
part of speech: verb
hypernym: 01835473-v