evacuate-v
type: LexicalEntry
canonical form: evacuate
sense: 01860436-v
part of speech: verb

01860436-v
type: LexicalConcept
in scheme: en-word.net
definition: move out of an unsafe location into safety
example: After the earthquake, residents were evacuated
ili: i30985
lexfile: verb.motion
part of speech: verb
hypernym: 01859592-v