move-v
type: LexicalEntry
canonical form: move
sense: 01859592-v
part of speech: verb

01859592-v
type: LexicalConcept
in scheme: en-word.net
definition: change residence, affiliation, or place of employment
example: We moved from Idaho to Nebraska
example: The basketball player moved from one team to another
ili: i30980
lexfile: verb.motion
part of speech: verb
hypernym: 00122978-v