repair-v
type: LexicalEntry
canonical form: repair
sense: 01847439-v
part of speech: verb

resort-v
type: LexicalEntry
canonical form: resort
sense: 01847439-v
part of speech: verb

01847439-v
type: LexicalConcept
in scheme: en-word.net
definition: move, travel, or proceed toward some place
example: He repaired to his cabin in the woods
ili: i30928
lexfile: verb.motion
part of speech: verb
hypernym: 01839438-v