interest-v
type: LexicalEntry
canonical form: interest
sense: 01825361-v
part of speech: verb

01825361-v
type: LexicalConcept
in scheme: en-word.net
definition: excite the curiosity of; engage the interest of
ili: i30833
lexfile: verb.emotion
part of speech: verb
hypernym: 01763170-v