discourage-v
type: LexicalEntry
canonical form: discourage
sense: 01823114-v
part of speech: verb

01823114-v
type: LexicalConcept
in scheme: en-word.net
definition: deprive of courage or hope; take away hope from; cause to feel discouraged
ili: i30821
lexfile: verb.emotion
part of speech: verb
hypernym: 00126072-v