elaborate-a
type: LexicalEntry
canonical form: elaborate
sense: 01800442-s
part of speech: adjective

luxuriant-a
type: LexicalEntry
canonical form: luxuriant
sense: 01800442-s
part of speech: adjective

01800442-s
type: LexicalConcept
in scheme: en-word.net
definition: marked by complexity and richness of detail
example: an elaborate lace pattern
ili: i9866
lexfile: adj.all
part of speech: adjective satellite
similar: https://en-word.net/synset/01798849-a