sting-v
type: LexicalEntry
canonical form: sting
sense: 01797753-v
part of speech: verb

01797753-v
type: LexicalConcept
in scheme: en-word.net
definition: cause an emotional pain, as if by stinging
example: His remark stung her
ili: i30699
lexfile: verb.emotion
part of speech: verb
hypernym: 01797206-v