embarrass-v
type: LexicalEntry
canonical form: embarrass
sense: 01796126-v
part of speech: verb

abash-v
type: LexicalEntry
canonical form: abash
sense: 01796126-v
part of speech: verb

01796126-v
type: LexicalConcept
in scheme: en-word.net
definition: cause to be embarrassed; cause to feel self-conscious
ili: i30692
lexfile: verb.emotion
part of speech: verb
hypernym: 01793821-v