madden-v
type: LexicalEntry
canonical form: madden
sense: 01791528-v
part of speech: verb

01791528-v
type: LexicalConcept
in scheme: en-word.net
definition: drive up the wall; go on someone's nerves
ili: i30673
lexfile: verb.emotion
part of speech: verb
hypernym: 01806967-v