fear-v
type: LexicalEntry
canonical form: fear
sense: 01784548-v
part of speech: verb

01784548-v
type: LexicalConcept
in scheme: en-word.net
definition: be afraid or feel anxious or apprehensive about a possible or probable situation or event
example: I fear she might get aggressive
ili: i30638
lexfile: verb.emotion
part of speech: verb
hypernym: 01771015-v