worry-v
type: LexicalEntry
canonical form: worry
sense: 01771015-v
part of speech: verb

01771015-v
type: LexicalConcept
in scheme: en-word.net
definition: be worried, concerned, anxious, troubled, or uneasy
example: I worry about my job
ili: i30573
lexfile: verb.emotion
part of speech: verb
hypernym: 01775456-v
similar: 01769760-v