raise-v
type: LexicalEntry
canonical form: raise
sense: 01759495-v
part of speech: verb

01759495-v
type: LexicalConcept
in scheme: en-word.net
definition: create a disturbance, especially by making a great noise
example: raise hell
example: raise the roof
example: raise Cain
ili: i30519
lexfile: verb.creation
part of speech: verb
hypernym: 01620211-v