write out-v
type: LexicalEntry
canonical form: write out
sense: 01758384-v
part of speech: verb

write up-v
type: LexicalEntry
canonical form: write up
sense: 01758384-v
part of speech: verb

01758384-v
type: LexicalConcept
in scheme: en-word.net
definition: put into writing; write in complete form
example: write out a contract
ili: i30512
lexfile: verb.creation
part of speech: verb
domain topic: 00931533-n
hypernym: 01702148-v