complete-a
type: LexicalEntry
canonical form: complete
sense: 01754870-s
part of speech: adjective

consummate-a
type: LexicalEntry
canonical form: consummate
sense: 01754870-s
part of speech: adjective

01754870-s
type: LexicalConcept
in scheme: en-word.net
definition: perfect and complete in every respect; having all necessary qualities
example: a complete gentleman
example: consummate happiness
example: a consummate performance
ili: i9606
lexfile: adj.all
part of speech: adjective satellite
similar: https://en-word.net/synset/01753804-a