model-v
type: LexicalEntry
canonical form: model
sense: 01747665-v
part of speech: verb

pattern-v
type: LexicalEntry
canonical form: pattern
sense: 01747665-v
part of speech: verb

01747665-v
type: LexicalConcept
in scheme: en-word.net
definition: plan or create according to a model or models
ili: i30452
lexfile: verb.creation
part of speech: verb
hypernym: 01746767-v