play-v
type: LexicalEntry
canonical form: play
sense: 01725954-v
part of speech: verb

01725954-v
type: LexicalConcept
in scheme: en-word.net
definition: pretend to be somebody in the framework of a game or playful activity
example: Let's play like I am mommy
example: Play cowboy and Indians
ili: i30349
lexfile: verb.creation
part of speech: verb
hypernym: 01725631-v
similar: 01723161-v