play-v
type: LexicalEntry
canonical form: play
sense: 01720741-v
part of speech: verb

01720741-v
type: LexicalConcept
in scheme: en-word.net
definition: be performed or presented for public viewing
example: What's playing in the local movie theater?
example: ‘Cats’ has been playing on Broadway for many years
ili: i30328
lexfile: verb.creation
part of speech: verb
domain topic: 06167042-n
hypernym: 02372362-v
similar: 01723780-v