biting-a
type: LexicalEntry
canonical form: biting
sense: 01716363-s
part of speech: adjective

bitter-a
type: LexicalEntry
canonical form: bitter
sense: 01716363-s
part of speech: adjective

01716363-s
type: LexicalConcept
in scheme: en-word.net
definition: causing a sharply painful or stinging sensation; used especially of cold
example: bitter cold
example: a biting wind
ili: i9385
lexfile: adj.all
part of speech: adjective satellite
similar: https://en-word.net/synset/01715524-a