spell-v
type: LexicalEntry
canonical form: spell
sense: 01703755-v
part of speech: verb

write-v
type: LexicalEntry
canonical form: write
sense: 01703755-v
part of speech: verb

01703755-v
type: LexicalConcept
in scheme: en-word.net
definition: write or name the letters that comprise the conventionally accepted form of (a word or part of a word)
example: He spelled the word wrong in this letter
ili: i30244
lexfile: verb.creation
part of speech: verb
hypernym: 00995046-v