sculpt-v
type: LexicalEntry
canonical form: sculpt
sense: 01688232-v
part of speech: verb

sculpture-v
type: LexicalEntry
canonical form: sculpture
sense: 01688232-v
part of speech: verb

01688232-v
type: LexicalConcept
in scheme: en-word.net
definition: create by shaping stone or wood or any other hard material
example: sculpt a swan out of a block of ice
ili: i30170
lexfile: verb.creation
part of speech: verb
domain topic: 00935235-n
hypernym: 01663142-v
similar: 01554653-v