great-a
type: LexicalEntry
canonical form: great
sense: 01682025-s
part of speech: adjective

01682025-s
type: LexicalConcept
in scheme: en-word.net
definition: remarkable or out of the ordinary in degree or magnitude or effect
example: a great crisis
example: had a great stake in the outcome
ili: i9189
lexfile: adj.all
part of speech: adjective satellite
similar: https://en-word.net/synset/01679784-a