hang-v
type: LexicalEntry
canonical form: hang
sense: 01681611-v
part of speech: verb

01681611-v
type: LexicalConcept
in scheme: en-word.net
definition: decorate or furnish with something suspended
example: Hang wallpaper
ili: i30128
lexfile: verb.creation
part of speech: verb
hypernym: 01679858-v