weave-v
type: LexicalEntry
canonical form: weave
sense: 01677786-v
part of speech: verb

tissue-v
type: LexicalEntry
canonical form: tissue
sense: 01677786-v
part of speech: verb

01677786-v
type: LexicalConcept
in scheme: en-word.net
definition: create a piece of cloth by interlacing strands of fabric, such as wool or cotton
example: tissue textiles
ili: i30113
lexfile: verb.creation
part of speech: verb
domain topic: 00716196-n
hypernym: 01656555-v