purl-v
type: LexicalEntry
canonical form: purl
sense: 01672173-v
part of speech: verb

01672173-v
type: LexicalConcept
in scheme: en-word.net
definition: edge or border with gold or silver embroidery
ili: i30077
lexfile: verb.creation
part of speech: verb
hypernym: 01671502-v
similar: 01672039-v