stick-v
type: LexicalEntry
canonical form: stick
sense: 01671864-v
part of speech: verb

01671864-v
type: LexicalConcept
in scheme: en-word.net
definition: cover and decorate with objects that pierce the surface
example: stick some feathers in the turkey before you serve it
ili: i30075
lexfile: verb.creation
part of speech: verb
hypernym: 01679858-v