frame-v
type: LexicalEntry
canonical form: frame
sense: 01659306-v
part of speech: verb

frame up-v
type: LexicalEntry
canonical form: frame up
sense: 01659306-v
part of speech: verb

01659306-v
type: LexicalConcept
in scheme: en-word.net
definition: construct by fitting or uniting parts together
ili: i30013
lexfile: verb.creation
part of speech: verb
domain topic: 00912746-n
hypernym: 01658171-v