mount-v
type: LexicalEntry
canonical form: mount
sense: 01652793-v
part of speech: verb

put on-v
type: LexicalEntry
canonical form: put on
sense: 01652793-v
part of speech: verb

01652793-v
type: LexicalConcept
in scheme: en-word.net
definition: prepare and supply with the necessary equipment for execution or performance
example: mount a theater production
example: mount an attack
example: mount a play
ili: i29985
lexfile: verb.creation
part of speech: verb
hypernym: 01654986-v