initiate-v
type: LexicalEntry
canonical form: initiate
sense: 01645456-v
part of speech: verb

pioneer-v
type: LexicalEntry
canonical form: pioneer
sense: 01645456-v
part of speech: verb

01645456-v
type: LexicalConcept
in scheme: en-word.net
definition: take the lead or initiative in; participate in the development of
example: This South African surgeon pioneered heart transplants
ili: i29949
lexfile: verb.creation
part of speech: verb
hypernym: 01649143-v