destroy-v
type: LexicalEntry
canonical form: destroy
sense: 01622948-v
part of speech: verb

destruct-v
type: LexicalEntry
canonical form: destruct
sense: 01622948-v
part of speech: verb

01622948-v
type: LexicalConcept
in scheme: en-word.net
definition: do away with, cause the destruction or undoing of
example: The fire destroyed the house
ili: i29858
lexfile: verb.creation
part of speech: verb
hypernym: 01622250-v