stick-v
type: LexicalEntry
canonical form: stick
sense: 01617485-v
part of speech: verb

01617485-v
type: LexicalConcept
in scheme: en-word.net
definition: fasten with an adhesive material like glue
example: stick the poster onto the wall
ili: i29830
lexfile: verb.contact
part of speech: verb
hypernym: 01346574-v
similar: 01223449-v
similar: 01617330-v
similar: 01617139-v