siphon-v
type: LexicalEntry
canonical form: siphon
sense: 01616295-v
part of speech: verb

01616295-v
type: LexicalConcept
in scheme: en-word.net
definition: move a liquid from one container into another by means of a siphon or a siphoning action
example: siphon gas into the tank
ili: i29823
lexfile: verb.contact
part of speech: verb
hypernym: 01496967-v