plaster-v
type: LexicalEntry
canonical form: plaster
sense: 01615868-v
part of speech: verb

beplaster-v
type: LexicalEntry
canonical form: beplaster
sense: 01615868-v
part of speech: verb

01615868-v
type: LexicalConcept
in scheme: en-word.net
definition: cover conspicuously or thickly, as by pasting something on
example: The demonstrators plastered the hallways with posters
example: She let the walls of the apartment be beplastered with stucco
ili: i29821
lexfile: verb.contact
part of speech: verb
hypernym: 01335412-v
similar: 01615722-v