pull-v
type: LexicalEntry
canonical form: pull
sense: 01612191-v
part of speech: verb

01612191-v
type: LexicalConcept
in scheme: en-word.net
definition: apply force so as to cause motion towards the source of the motion
example: Pull the rope
example: Pull the handle towards you
example: pull the string gently
example: pull the trigger of the gun
example: pull your knees towards your chin
ili: i29801
lexfile: verb.contact
part of speech: verb
hypernym: 01353131-v
similar: 01450719-v