graze-v
type: LexicalEntry
canonical form: graze
sense: 01611412-v
part of speech: verb

01611412-v
type: LexicalConcept
in scheme: en-word.net
definition: break the skin (of a body part) by scraping
example: She was grazed by the stray bullet
ili: i29797
lexfile: verb.contact
part of speech: verb
hypernym: 00069650-v