circumscribe-v
type: LexicalEntry
canonical form: circumscribe
sense: 01586577-v
part of speech: verb

01586577-v
type: LexicalConcept
in scheme: en-word.net
definition: to draw a geometric figure around another figure so that the two are in contact but do not intersect
ili: i29646
lexfile: verb.contact
part of speech: verb
domain topic: 06014015-n
hypernym: 01585566-v
similar: 01586415-v