lift-v
type: LexicalEntry
canonical form: lift
sense: 01582002-v
part of speech: verb

01582002-v
type: LexicalConcept
in scheme: en-word.net
definition: take hold of something and move it to a different location
example: lift the box onto the table
ili: i29622
lexfile: verb.contact
part of speech: verb
hypernym: 01854282-v