afforest-v
type: LexicalEntry
canonical form: afforest
sense: 01570669-v
part of speech: verb

forest-v
type: LexicalEntry
canonical form: forest
sense: 01570669-v
part of speech: verb

01570669-v
type: LexicalConcept
in scheme: en-word.net
definition: establish a forest on previously unforested land
example: afforest the mountains
ili: i29569
lexfile: verb.contact
part of speech: verb
hypernym: 01570056-v