subvert-v
type: LexicalEntry
canonical form: subvert
sense: 01567809-v
part of speech: verb

01567809-v
type: LexicalConcept
in scheme: en-word.net
definition: to raze to the ground, also figuratively
example: we must not let our civil liberties be subverted by the current crisis
ili: i29554
lexfile: verb.contact
part of speech: verb
hypernym: 01566925-v